Target
Lysine-specific demethylase 5A
Ligand
BDBM314122
Substrate
Meas. Tech.
Jarid1A Assay
IC50
<100±n/a nM
Citation
 Chen, YKKanouni, TNie, ZStafford, JAVeal, JMWallace, MB Histone demethylase inhibitors US Patent  US10179769 Publication Date 1/15/2019 
Target
Name:
Lysine-specific demethylase 5A
Synonyms:
Histone demethylase JARID1A Jumonji/ARID domain-containing protein 1A KDM5A_HUMAN RBBP-2 RBP2 | Retinoblastoma-binding protein 2
Type:
Protein
Mol. Mass.:
192091.79
Organism:
Homo sapiens (Human)
Description:
P29375
Residue:
1690
  
Inhibitor
Name:
BDBM314122
Synonyms:
3-[(4-chloro-2-cyclopropylbenzyl)amino]pyridine-4-carboxylic acid US10807956, Example 26 US11639333, Example 26 US9725441, Example 26 | US9828343, Example 26
Type:
Small organic molecule
Emp. Form.:
C16H15ClN2O2
Mol. Mass.:
302.756
SMILES:
OC(=O)c1ccncc1NCc1ccc(Cl)cc1C1CC1
: