Target
Tyrosine-protein kinase JAK1
Ligand
BDBM292104
Substrate
Meas. Tech.
Biochemical JAK and Off-Target Kinase Assays
Ki
<0.1±n/a nM
Citation
 Benjamin, NDabros, MThalladi, VR JAK kinase inhibitor compounds for treatment of respiratory disease US Patent  US10183942 Publication Date 1/22/2019 
Target
Name:
Tyrosine-protein kinase JAK1
Synonyms:
JAK-1 JAK1A JAK1_HUMAN Janus kinase 1 (JAK1) | Janus kinase 1 JAK1
Type:
Protein
Mol. Mass.:
133293.73
Organism:
Homo sapiens (Human)
Description:
P23458
Residue:
1154
  
Inhibitor
Name:
BDBM292104
Synonyms:
US10100049, Example 1 US10526330, Example 1 US11299492, Example 1 | US11718616, Example 1
Type:
Small organic molecule
Emp. Form.:
C25H27FN6O
Mol. Mass.:
446.5199
SMILES:
CCc1cc(O)c(F)cc1-c1ccc2c(n[nH]c2c1)-c1nc2CN(CCc2[nH]1)C1CN(C)C1
: