Target
Ataxin-2
Ligand
BDBM323244
Substrate
Meas. Tech.
Inhibition Assay
IC50
5.00±n/a nM
Citation
 Furminger, VHughes, ORLe Grand, DMStanley, EThomson, C Autotaxin inhibitors US Patent  US9630945 Publication Date 4/25/2017 
Target
Name:
Ataxin-2
Synonyms:
ATX2 ATXN2 Spinocerebellar ataxia type 2 protein Trinucleotide repeat-containing gene 13 protein
Type:
Mol. Mass.:
140337.65
Organism:
Homo sapiens (Human)
Description:
Q99700
Residue:
1313
  
Inhibitor
Name:
BDBM323244
Synonyms:
3-Cyano-5-(trifluoromethoxy)benzyl 4-(4-(1H-1,2,3-triazol-4-yl)butanamido)piperidine-1-carboxylate | US9630945, 70
Type:
Small organic molecule
Emp. Form.:
C21H23F3N6O4
Mol. Mass.:
480.4403
SMILES:
FC(F)(F)Oc1cc(COC(=O)N2CCC(CC2)NC(=O)CCCc2c[nH]nn2)cc(c1)C#N
: