Target
Glycogen synthase kinase-3 beta
Ligand
BDBM161376
Substrate
Meas. Tech.
GSK 3α Enzyme Inhibition
Kd
1200±n/a nM
Citation
 Ito, KCharron, CEKing-Underwood, JOnions, STLongshaw, AI 1-pyrazolyl-3-(4-((2-anilinopyrimidin-4-yl)oxy)napththalen-1-yl) ureas as P38 MAP knase inhibitors US Patent  US9724347 Publication Date 8/8/2017 
Target
Name:
Glycogen synthase kinase-3 beta
Synonyms:
GSK-3 beta GSK3B Glycogen synthase kinase 3 beta (GSK3B) Glycogen synthase kinase-3 beta (GSK-3B) Glycogen synthase kinase-3 beta (GSK3B) Glycogen synthase kinase-3beta (GSK3B) | Serine/threonine-protein kinase GSK3B
Type:
Enzyme
Mol. Mass.:
46756.38
Organism:
Homo sapiens (Human)
Description:
P49841
Residue:
420
  
Inhibitor
Name:
BDBM161376
Synonyms:
US10238658, Example 1 US9108950, 1 US9993478, Example 1
Type:
Small organic molecule
Emp. Form.:
C35H33N7O2
Mol. Mass.:
583.6822
SMILES:
Cc1ccc(cc1)-n1nc(cc1NC(=O)Nc1ccc(Oc2ccnc(Nc3ccccc3)n2)c2ccccc12)C(C)(C)C
: