Target
Lethal factor
Ligand
BDBM11984
Substrate
fluorogenic LF protease substrate III
Meas. Tech.
HPLC Assay
pH
7.2±n/a
Temperature
300.15±n/a K
Ki
2400±n/a nM
IC50
5200±n/a nM
Citation
 Schepetkin, IAKhlebnikov, AIKirpotina, LNQuinn, MT Novel small-molecule inhibitors of anthrax lethal factor identified by high-throughput screening. J Med Chem 49:5232-44 (2006)  
Target
Name:
Lethal factor
Synonyms:
Anthrax Lethal Factor (LF) Antrax lethal toxin lef | lethal factor
Type:
PROTEIN
Mol. Mass.:
93758.56
Organism:
Bacillus anthracis
Description:
ChEMBL_1460338
Residue:
809
  
Inhibitor
Name:
BDBM11984
Synonyms:
2-chloro-4-{5-[N-(3-cyano-4,5,6,7-tetrahydro-1-benzothiophen-2-yl)carboximidoyl]furan-2-yl}benzoic acid | chemical diversity library compound 9
Type:
Small organic molecule
Emp. Form.:
C21H15ClN2O3S
Mol. Mass.:
410.873
SMILES:
OC(=O)c1ccc(cc1Cl)-c1ccc(\C=N/c2sc3CCCCc3c2C#N)o1
:
Substrate
Name:
fluorogenic LF protease substrate III
Synonyms:
Type:
Peptide
Mol. Mass.:
358.43
Organism:
Description:
Residue:
3
NA