Target
Lethal factor
Ligand
BDBM11993
Substrate
fluorogenic LF protease substrate III
Meas. Tech.
HPLC Assay
pH
7.2±n/a
Temperature
300.15±n/a K
Ki
2100±n/a nM
IC50
10000±n/a nM
Citation
 Schepetkin, IAKhlebnikov, AIKirpotina, LNQuinn, MT Novel small-molecule inhibitors of anthrax lethal factor identified by high-throughput screening. J Med Chem 49:5232-44 (2006)  
Target
Name:
Lethal factor
Synonyms:
Anthrax Lethal Factor (LF) Antrax lethal toxin lef | lethal factor
Type:
PROTEIN
Mol. Mass.:
93758.56
Organism:
Bacillus anthracis
Description:
ChEMBL_1460338
Residue:
809
  
Inhibitor
Name:
BDBM11993
Synonyms:
2-chloro-5-[(4Z)-4-{[5-(4-chlorophenyl)furan-2-yl]methylidene}-3-methyl-5-oxo-4,5-dihydro-1H-pyrazol-1-yl]benzoic acid | chemical diversity library compound 18
Type:
Small organic molecule
Emp. Form.:
C22H14Cl2N2O4
Mol. Mass.:
441.264
SMILES:
OC(=O)c1cc(ccc1Cl)-n1[nH]c(=C)c(=Cc2ccc(o2)-c2ccc(Cl)cc2)c1=O
:
Substrate
Name:
fluorogenic LF protease substrate III
Synonyms:
Type:
Peptide
Mol. Mass.:
358.43
Organism:
Description:
Residue:
3
NA