Target
Non-specific protein-tyrosine kinase
Ligand
BDBM50328124
Substrate
Meas. Tech.
Kinase Assay
pH
7.5±n/a
IC50
160±n/a nM
Comments
extracted
Citation
 Gray, NSZhang, JOkram, BDeng, X Small molecule myristate inhibitors of Bcr-abl and methods of use US Patent  US9670214 Publication Date 6/6/2017 
Target
Name:
Non-specific protein-tyrosine kinase
Synonyms:
BCR/ABL fusion protein isoform X3
Type:
Protein
Mol. Mass.:
178596.49
Organism:
Homo sapiens (Human)
Description:
A9UEZ6
Residue:
1633
  
Inhibitor
Name:
BDBM50328124
Synonyms:
1-tert-butyl-N-(4-(trifluoromethoxy)phenyl)-1H-pyrazolo[3,4-d]pyrimidin-4-amine US9670214, TABLE 10.17
Type:
Small organic molecule
Emp. Form.:
C16H16F3N5O
Mol. Mass.:
351.3263
SMILES:
CC(C)(C)n1ncc2c(Nc3ccc(OC(F)(F)F)cc3)ncnc12
: