Target
Non-specific protein-tyrosine kinase
Ligand
BDBM50328120
Substrate
Meas. Tech.
Kinase Assay
pH
7.5±n/a
IC50
400±n/a nM
Comments
extracted
Citation
 Gray, NSZhang, JOkram, BDeng, X Small molecule myristate inhibitors of Bcr-abl and methods of use US Patent  US9670214 Publication Date 6/6/2017 
Target
Name:
Non-specific protein-tyrosine kinase
Synonyms:
BCR/ABL fusion protein isoform X3
Type:
Protein
Mol. Mass.:
178596.49
Organism:
Homo sapiens (Human)
Description:
A9UEZ6
Residue:
1633
  
Inhibitor
Name:
BDBM50328120
Synonyms:
1-benzyl-N-(4-(trifluoromethoxy)phenyl)-1H-pyrazolo[3,4-d]pyrimidin-4-amine US9670214, TABLE 10.20
Type:
Small organic molecule
Emp. Form.:
C19H14F3N5O
Mol. Mass.:
385.3426
SMILES:
FC(F)(F)Oc1ccc(Nc2ncnc3n(Cc4ccccc4)ncc23)cc1
: