Target
Non-specific protein-tyrosine kinase
Ligand
BDBM50328184
Substrate
Meas. Tech.
Kinase Assay
pH
7.5±n/a
IC50
330±n/a nM
Comments
extracted
Citation
 Gray, NSZhang, JOkram, BDeng, X Small molecule myristate inhibitors of Bcr-abl and methods of use US Patent  US9670214 Publication Date 6/6/2017 
Target
Name:
Non-specific protein-tyrosine kinase
Synonyms:
BCR/ABL fusion protein isoform X3
Type:
Protein
Mol. Mass.:
178596.49
Organism:
Homo sapiens (Human)
Description:
A9UEZ6
Residue:
1633
  
Inhibitor
Name:
BDBM50328184
Synonyms:
(4-(4-(trifluoromethoxy)phenylamino)thieno[2,3-d]pyrimidin-6-yl)methanol US9670214, TABLE 13.4
Type:
Small organic molecule
Emp. Form.:
C14H10F3N3O2S
Mol. Mass.:
341.308
SMILES:
OCc1cc2c(Nc3ccc(OC(F)(F)F)cc3)ncnc2s1
: