Target
Non-specific protein-tyrosine kinase
Ligand
BDBM50328151
Substrate
Meas. Tech.
Kinase Assay
pH
7.5±n/a
IC50
120±n/a nM
Comments
extracted
Citation
 Gray, NSZhang, JOkram, BDeng, X Small molecule myristate inhibitors of Bcr-abl and methods of use US Patent  US9670214 Publication Date 6/6/2017 
Target
Name:
Non-specific protein-tyrosine kinase
Synonyms:
BCR/ABL fusion protein isoform X3
Type:
Protein
Mol. Mass.:
178596.49
Organism:
Homo sapiens (Human)
Description:
A9UEZ6
Residue:
1633
  
Inhibitor
Name:
BDBM50328151
Synonyms:
4-(6-(4-(trifluoromethoxy)phenylamino)pyrimidin-4-yl)benzenesulfonamide US9670214, TABLE 16.1
Type:
Small organic molecule
Emp. Form.:
C17H13F3N4O3S
Mol. Mass.:
410.37
SMILES:
NS(=O)(=O)c1ccc(cc1)-c1cc(Nc2ccc(OC(F)(F)F)cc2)ncn1
: