Target
Non-specific protein-tyrosine kinase
Ligand
BDBM50328136
Substrate
Meas. Tech.
Kinase Assay
pH
7.5±n/a
IC50
90±n/a nM
Comments
extracted
Citation
 Gray, NSZhang, JOkram, BDeng, X Small molecule myristate inhibitors of Bcr-abl and methods of use US Patent  US9670214 Publication Date 6/6/2017 
Target
Name:
Non-specific protein-tyrosine kinase
Synonyms:
BCR/ABL fusion protein isoform X3
Type:
Protein
Mol. Mass.:
178596.49
Organism:
Homo sapiens (Human)
Description:
A9UEZ6
Residue:
1633
  
Inhibitor
Name:
BDBM50328136
Synonyms:
6-(1H-pyrazol-4-yl)-N-(4-(trifluoromethoxy)phenyl)pyrimidin-4-amine US9670214, TABLE 16.43
Type:
Small organic molecule
Emp. Form.:
C14H10F3N5O
Mol. Mass.:
321.2573
SMILES:
FC(F)(F)Oc1ccc(Nc2cc(ncn2)-c2cn[nH]c2)cc1
: