Target
Non-specific protein-tyrosine kinase
Ligand
BDBM196599
Substrate
Meas. Tech.
Kinase Assay
pH
7.5±n/a
IC50
160±n/a nM
Comments
extracted
Citation
 Gray, NSZhang, JOkram, BDeng, X Small molecule myristate inhibitors of Bcr-abl and methods of use US Patent  US9670214 Publication Date 6/6/2017 
Target
Name:
Non-specific protein-tyrosine kinase
Synonyms:
BCR/ABL fusion protein isoform X3
Type:
Protein
Mol. Mass.:
178596.49
Organism:
Homo sapiens (Human)
Description:
A9UEZ6
Residue:
1633
  
Inhibitor
Name:
BDBM196599
Synonyms:
US9670214, TABLE 16.48
Type:
Small organic molecule
Emp. Form.:
C22H18F3N5O3S
Mol. Mass.:
489.47
SMILES:
CS(=O)(=O)c1ccc(Cn2cc(cn2)-c2cc(Nc3ccc(OC(F)(F)F)cc3)ncn2)cc1
: