Target
Non-specific protein-tyrosine kinase
Ligand
BDBM196601
Substrate
Meas. Tech.
Kinase Assay
pH
7.5±n/a
IC50
190±n/a nM
Comments
extracted
Citation
 Gray, NSZhang, JOkram, BDeng, X Small molecule myristate inhibitors of Bcr-abl and methods of use US Patent  US9670214 Publication Date 6/6/2017 
Target
Name:
Non-specific protein-tyrosine kinase
Synonyms:
BCR/ABL fusion protein isoform X3
Type:
Protein
Mol. Mass.:
178596.49
Organism:
Homo sapiens (Human)
Description:
A9UEZ6
Residue:
1633
  
Inhibitor
Name:
BDBM196601
Synonyms:
US9670214, TABLE 16.50
Type:
Small organic molecule
Emp. Form.:
C20H15F3N6O
Mol. Mass.:
412.3679
SMILES:
FC(F)(F)Oc1ccc(Nc2cc(ncn2)-c2cnn(Cc3ccncc3)c2)cc1
: