Target
Proteasome subunit alpha type-6
Ligand
BDBM67544
Substrate
Meas. Tech.
Proteasome Activity Assay
pH
7.5±n/a
Temperature
310.15±n/a K
EC50
7800±0.0 nM
Comments
extracted
Citation
 Jones, CLNjomen, ESjögren, BDexheimer, TSTepe, JJ Small Molecule Enhancement of 20S Proteasome Activity Targets Intrinsically Disordered Proteins. ACS Chem Biol 12:2240-2247 (2017)  
Target
Name:
Proteasome subunit alpha type-6
Synonyms:
27 kDa prosomal protein Multicatalytic endopeptidase complex iota chain PROS27 PSMA6 p27K
Type:
PROTEIN
Mol. Mass.:
27399.66
Organism:
Homo sapiens (Human)
Description:
ChEMBL_106197
Residue:
246
  
Inhibitor
Name:
BDBM67544
Synonyms:
N,N-dimethyl-3-[2-(trifluoromethyl)-10-phenothiazinyl]-1-propanamine;hydrochloride SR-01000000224-4 cid_66069 med.21724, Compound Triflupromazine
Type:
Small organic molecule
Emp. Form.:
C18H19F3N2S
Mol. Mass.:
352.417
SMILES:
CN(C)CCCN1c2ccccc2Sc2ccc(cc12)C(F)(F)F
: