Target
Proteasome subunit alpha type-6
Ligand
BDBM65514
Substrate
Meas. Tech.
Proteasome Activity Assay
pH
7.5±n/a
Temperature
310.15±n/a K
EC50
15600±0.0 nM
Comments
extracted
Citation
 Jones, CLNjomen, ESjögren, BDexheimer, TSTepe, JJ Small Molecule Enhancement of 20S Proteasome Activity Targets Intrinsically Disordered Proteins. ACS Chem Biol 12:2240-2247 (2017)  
Target
Name:
Proteasome subunit alpha type-6
Synonyms:
27 kDa prosomal protein Multicatalytic endopeptidase complex iota chain PROS27 PSMA6 p27K
Type:
PROTEIN
Mol. Mass.:
27399.66
Organism:
Homo sapiens (Human)
Description:
ChEMBL_106197
Residue:
246
  
Inhibitor
Name:
BDBM65514
Synonyms:
CPZ analog, 8
Type:
Small organic molecule
Emp. Form.:
C21H16ClNO2S
Mol. Mass.:
381.875
SMILES:
COC(=O)c1ccc(CN2c3ccccc3Sc3ccc(Cl)cc23)cc1
: