Target
Dimer of Gag-Pol polyprotein [491-589,Q498K,D521N,V555I,N579D]
Ligand
BDBM12877
Substrate
HIV-1 Protease Substrate
Meas. Tech.
Enzyme Inhibition Assay
pH
4.7±n/a
Temperature
303.15±n/a K
Ki
0.039±n/a nM
Citation
 Ali, AReddy, GSCao, HAnjum, SGNalam, MNSchiffer, CARana, TM Discovery of HIV-1 protease inhibitors with picomolar affinities incorporating N-aryl-oxazolidinone-5-carboxamides as novel P2 ligands. J Med Chem 49:7342-56 (2006)  
Target
Name:
Dimer of Gag-Pol polyprotein [491-589,Q498K,D521N,V555I,N579D]
Synonyms:
HIV-1 Protease Mutant M2 (D30N, L63P, N88D)
Type:
Protein Complex
Mol. Mass.:
Description:
Components:
This complex has 2 components.
Component 1
Name:
Gag-Pol polyprotein [491-589,Q498K,D521N,V555I,N579D]
Synonyms:
HIV-1 Protease Mutant M2 (D30N, L63P, N88D) chain A POL_HV1A2 | gag-pol
Type:
Enzyme Subunit
Mol. Mass.:
10807.22
Organism:
Human immunodeficiency virus type 1
Description:
P03369[491-589,Q498K,D521N,V555I,N579D]
Residue:
99
  
Component 2
Name:
Gag-Pol polyprotein [491-589,Q498K,D521N,V555I,N579D]
Synonyms:
HIV-1 Protease Mutant M2 (D30N, L63P, N88D) chain A POL_HV1A2 | gag-pol
Type:
Enzyme Subunit
Mol. Mass.:
10807.22
Organism:
Human immunodeficiency virus type 1
Description:
P03369[491-589,Q498K,D521N,V555I,N579D]
Residue:
99
  
Inhibitor
Name:
BDBM12877
Synonyms:
(5S)-3-(3-Acetylphenyl)-N-[(1S,2R)-1-benzyl-2-hydroxy-3-[isobutyl[(4-methoxyphenyl)sulfonyl]amino]propyl]-2-oxooxazolidine-5-carboxamide N-Aryl-oxazolidinone-5-carboxamide Analogue 21e
Type:
Small organic molecule
Emp. Form.:
C33H39N3O8S
Mol. Mass.:
637.743
SMILES:
COc1ccc(cc1)S(=O)(=O)N(CC(C)C)C[C@@H](O)[C@H](Cc1ccccc1)NC(=O)[C@@H]1CN(C(=O)O1)c1cccc(c1)C(C)=O
:
Substrate
Name:
HIV-1 Protease Substrate
Synonyms:
Type:
Peptide
Mol. Mass.:
4728.18
Organism:
Description:
Residue:
44