Target
5'-AMP-activated protein kinase catalytic subunit alpha-1
Ligand
BDBM200995
Substrate
Meas. Tech.
In Vitro AMPK Activation Assay
pH
7.3±n/a
EC50
8.00±0 nM
Comments
extracted
Citation
 Apgar, JMBiftu, TChen, PFeng, DHicks, JDKekec, ALeavitt, KJLi, BSebhat, IQian, XWei, LWilkening, RRWu, Z Benzimidazole tetrahydrofuran derivatives US Patent  US9540364 Publication Date 1/10/2017 
Target
Name:
5'-AMP-activated protein kinase catalytic subunit alpha-1
Synonyms:
AAPK1_HUMAN AMP-activated protein kinase alpha-1/beta-2/gamma-2 AMPK subunit alpha-1 AMPK1 PRKAA1 | Tau-protein kinase PRKAA1
Type:
Protein
Mol. Mass.:
64023.62
Organism:
Homo sapiens (Human)
Description:
Q13131
Residue:
559
  
Inhibitor
Name:
BDBM200995
Synonyms:
US9540364, example 7
Type:
Small organic molecule
Emp. Form.:
C26H22ClN5O4
Mol. Mass.:
503.937
SMILES:
OC[C@H]1OC[C@@H](Oc2nc3cc(c(Cl)cc3[nH]2)-c2ccc(cc2)-c2ccc(cc2)-n2ccnn2)[C@@H]1O
: