Target
Flap endonuclease 1
Ligand
BDBM283248
Substrate
Meas. Tech.
Binding Assay
Ki
<1±n/a nM
Comments
Zero 01/04/2022
Citation
 Bacani, GMEccles, WFitzgerald, AEGoldberg, SDHack, MDHawryluk, NAJones, WMKeith, JMKrawczuk, PLebsack, ADLee-Dutra, ALiu, JMcClure, KJMeduna, SPPippel, DJRosen, MDSales, ZS Flap modulators US Patent  US9745328 Publication Date 8/29/2017 
Target
Name:
Flap endonuclease 1
Synonyms:
DNase IV FEN1 Flap structure-specific endonuclease 1 Maturation factor 1 hFEN-1
Type:
PROTEIN
Mol. Mass.:
42602.57
Organism:
Homo sapiens (Human)
Description:
ChEMBL_1517026
Residue:
380
  
Inhibitor
Name:
BDBM283248
Synonyms:
(trans)-4'-(5-Aminopyrazin-2-yl)-3'-fluoro-N-[2- (hydroxymethyl)cyclohexyl]biphenyl-2- sulfonamide US9884878, Compound 121
Type:
Small organic molecule
Emp. Form.:
C23H25FN4O3S
Mol. Mass.:
456.533
SMILES:
Nc1cnc(cn1)-c1ccc(cc1F)-c1ccccc1S(=O)(=O)N[C@H]1CCCC[C@@H]1CO
: