Target
Histone deacetylase 1
Ligand
BDBM50398721
Substrate
Meas. Tech.
Inhibition Assay
IC50
2250±420 nM
Citation
 Sotomayor, EMBergman, JAKozikowski, APVillagra, AVWoan, KV Selective histone deactylase 6 inhibitors US Patent  US9751832 Publication Date 9/5/2017 
Target
Name:
Histone deacetylase 1
Synonyms:
Cereblon/Histone deacetylase 1 HDAC1 Histone deacetylase 1 (HDAC1) RPD3L1
Type:
Enzyme
Mol. Mass.:
55090.27
Organism:
Homo sapiens (Human)
Description:
Q13547
Residue:
482
  
Inhibitor
Name:
BDBM50398721
Synonyms:
CHEMBL2179617 US9409858, 5f US9956192, Compound 5f
Type:
Small organic molecule
Emp. Form.:
C18H21N3O4
Mol. Mass.:
343.377
SMILES:
COCCN(Cc1ccc(cc1)C(=O)NO)C(=O)Nc1ccccc1
: