Target
Chymase
Ligand
BDBM337709
Substrate
Meas. Tech.
Enzymatic Assay
IC50
54.0±n/a nM
Citation
 Fürstner, CAckerstaff, JStraub, AMeier, HTinel, HZimmermann, KTersteegen, AZubov, DKast, RSchamberger, JSchäfer, M Substituted uracils and use thereof US Patent  US9751843 Publication Date 9/5/2017 
Target
Name:
Chymase
Synonyms:
Alpha-chymase CMA1_HUMAN CYM Mast cell protease I
Type:
Enzyme
Mol. Mass.:
27340.12
Organism:
Homo sapiens (Human)
Description:
Residue:
247
  
Inhibitor
Name:
BDBM337709
Synonyms:
3-(3-Chloro-2-nitrobenzyl)-2,4-dioxo-1-[4-(2-oxo-1,3-oxazolidin-3-yl)phenyl]-1,2,3,4-tetrahydropyrimidine-5-carboxylic acid | US9751843, 82
Type:
Small organic molecule
Emp. Form.:
C21H15ClN4O8
Mol. Mass.:
486.819
SMILES:
OC(=O)c1cn(-c2ccc(cc2)N2CCOC2=O)c(=O)n(Cc2cccc(Cl)c2[N+]([O-])=O)c1=O
: