Target
Chymase
Ligand
BDBM337764
Substrate
Meas. Tech.
Enzymatic Assay
IC50
31.0±n/a nM
Citation
 Fürstner, CAckerstaff, JStraub, AMeier, HTinel, HZimmermann, KTersteegen, AZubov, DKast, RSchamberger, JSchäfer, M Substituted uracils and use thereof US Patent  US9751843 Publication Date 9/5/2017 
Target
Name:
Chymase
Synonyms:
Alpha-chymase CMA1_HUMAN CYM Mast cell protease I
Type:
Enzyme
Mol. Mass.:
27340.12
Organism:
Homo sapiens (Human)
Description:
Residue:
247
  
Inhibitor
Name:
BDBM337764
Synonyms:
1-[2-Fluoro-4-(2-oxo-1,3-oxazolidin-3-yl)phenyl]-3-[2-methyl-3-(trifluoromethyl)benzyl]-2,4-dioxo-1,2,3,4-tetrahydropyrimidine-5-carboxylic acid | US9751843, 157
Type:
Small organic molecule
Emp. Form.:
C23H17F4N3O6
Mol. Mass.:
507.3912
SMILES:
Cc1c(Cn2c(=O)c(cn(-c3ccc(cc3F)N3CCOC3=O)c2=O)C(O)=O)cccc1C(F)(F)F
: