Target
Chymase
Ligand
BDBM337793
Substrate
Meas. Tech.
Enzymatic Assay
IC50
17.0±n/a nM
Citation
 Fürstner, CAckerstaff, JStraub, AMeier, HTinel, HZimmermann, KTersteegen, AZubov, DKast, RSchamberger, JSchäfer, M Substituted uracils and use thereof US Patent  US9751843 Publication Date 9/5/2017 
Target
Name:
Chymase
Synonyms:
Alpha-chymase CMA1_HUMAN CYM Mast cell protease I
Type:
Enzyme
Mol. Mass.:
27340.12
Organism:
Homo sapiens (Human)
Description:
Residue:
247
  
Inhibitor
Name:
BDBM337793
Synonyms:
2,4-Dioxo-1-[4-(2-oxo-1,3-oxazolidin-3-yl)phenyl]-3-[(1R)-4-(trifluoromethyl)-2,3-dihydro-1H-inden-1-yl]-1,2,3,4-tetrahydropyrimidine-5-carboxylic acid (R enantiomer) | US9751843, 187
Type:
Small organic molecule
Emp. Form.:
C24H18F3N3O6
Mol. Mass.:
501.4114
SMILES:
OC(=O)c1cn(-c2ccc(cc2)N2CCOC2=O)c(=O)n([C@@H]2CCc3c2cccc3C(F)(F)F)c1=O
: