Target
Retinaldehyde-binding protein 1
Ligand
BDBM338909
Substrate
Meas. Tech.
Isomerase Assay
IC50
<100.0±n/a nM
Citation
 Scott, ILKuksa, VAGall, AOrme, MWGage, JLittle, Jr., TLJiang, QRossiter, LMMcGee, Jr., KFKubota, R Styrenyl derivative compounds for treating ophthalmic diseases and disorders US Patent  US10201545 Publication Date 2/12/2019 
Target
Name:
Retinaldehyde-binding protein 1
Synonyms:
CRALBP RLBP1 | RLBP1_HUMAN
Type:
Enzyme Catalytic Domain
Mol. Mass.:
36462.25
Organism:
Homo sapiens (Human)
Description:
P12271
Residue:
317
  
Inhibitor
Name:
BDBM338909
Synonyms:
(E)-1-(3-(3-amino-1-hydroxypropyl)-5- fluorostyryl)cyclohexanol | US10201545, Compound 114
Type:
Small organic molecule
Emp. Form.:
C17H24FNO2
Mol. Mass.:
293.3764
SMILES:
NCCC(O)c1cc(F)cc(\C=C\C2(O)CCCCC2)c1
: