Target
Retinaldehyde-binding protein 1
Ligand
BDBM338912
Substrate
Meas. Tech.
Isomerase Assay
IC50
<100.0±n/a nM
Citation
 Scott, ILKuksa, VAGall, AOrme, MWGage, JLittle, Jr., TLJiang, QRossiter, LMMcGee, Jr., KFKubota, R Styrenyl derivative compounds for treating ophthalmic diseases and disorders US Patent  US10201545 Publication Date 2/12/2019 
Target
Name:
Retinaldehyde-binding protein 1
Synonyms:
CRALBP RLBP1 | RLBP1_HUMAN
Type:
Enzyme Catalytic Domain
Mol. Mass.:
36462.25
Organism:
Homo sapiens (Human)
Description:
P12271
Residue:
317
  
Inhibitor
Name:
BDBM338912
Synonyms:
(E)-1-(5-(3-amino-1-hydroxypropyl)-2- methoxystyryl)cyclohexanol | US10201545, Compound 120
Type:
Small organic molecule
Emp. Form.:
C18H27NO3
Mol. Mass.:
305.4119
SMILES:
COc1ccc(cc1\C=C\C1(O)CCCCC1)C(O)CCN
: