Target
Retinaldehyde-binding protein 1
Ligand
BDBM338930
Substrate
Meas. Tech.
Isomerase Assay
IC50
<1000±n/a nM
Citation
 Scott, ILKuksa, VAGall, AOrme, MWGage, JLittle, Jr., TLJiang, QRossiter, LMMcGee, Jr., KFKubota, R Styrenyl derivative compounds for treating ophthalmic diseases and disorders US Patent  US10201545 Publication Date 2/12/2019 
Target
Name:
Retinaldehyde-binding protein 1
Synonyms:
CRALBP RLBP1 | RLBP1_HUMAN
Type:
Enzyme Catalytic Domain
Mol. Mass.:
36462.25
Organism:
Homo sapiens (Human)
Description:
P12271
Residue:
317
  
Inhibitor
Name:
BDBM338930
Synonyms:
(E)-3-fluoro-3-(3-(2-(2,6,6-trimethylcyclohex-1- enyl)vinyl)phenyl)propan-1-amine | US10201545, Compound 55
Type:
Small organic molecule
Emp. Form.:
C20H28FN
Mol. Mass.:
301.4414
SMILES:
CC1=C(\C=C\c2cccc(c2)C(F)CCN)C(C)(C)CCC1
: