Target
Retinaldehyde-binding protein 1
Ligand
BDBM338943
Substrate
Meas. Tech.
Isomerase Assay
IC50
<1000±n/a nM
Citation
 Scott, ILKuksa, VAGall, AOrme, MWGage, JLittle, Jr., TLJiang, QRossiter, LMMcGee, Jr., KFKubota, R Styrenyl derivative compounds for treating ophthalmic diseases and disorders US Patent  US10201545 Publication Date 2/12/2019 
Target
Name:
Retinaldehyde-binding protein 1
Synonyms:
CRALBP RLBP1 | RLBP1_HUMAN
Type:
Enzyme Catalytic Domain
Mol. Mass.:
36462.25
Organism:
Homo sapiens (Human)
Description:
P12271
Residue:
317
  
Inhibitor
Name:
BDBM338943
Synonyms:
(E)-4-(3-(3-aminopropyl)styryl)heptan-4-ol | US10201545, Compound 83
Type:
Small organic molecule
Emp. Form.:
C18H29NO
Mol. Mass.:
275.429
SMILES:
CCCC(O)(CCC)\C=C\c1cccc(CCCN)c1
: