Target
Retinaldehyde-binding protein 1
Ligand
BDBM338945
Substrate
Meas. Tech.
Isomerase Assay
IC50
<1000±n/a nM
Citation
 Scott, ILKuksa, VAGall, AOrme, MWGage, JLittle, Jr., TLJiang, QRossiter, LMMcGee, Jr., KFKubota, R Styrenyl derivative compounds for treating ophthalmic diseases and disorders US Patent  US10201545 Publication Date 2/12/2019 
Target
Name:
Retinaldehyde-binding protein 1
Synonyms:
CRALBP RLBP1 | RLBP1_HUMAN
Type:
Enzyme Catalytic Domain
Mol. Mass.:
36462.25
Organism:
Homo sapiens (Human)
Description:
P12271
Residue:
317
  
Inhibitor
Name:
BDBM338945
Synonyms:
(E)-1-(3-(3-aminopropyl)phenyl)hex-1-en-3-ol | US10201545, Compound 84
Type:
Small organic molecule
Emp. Form.:
C15H23NO
Mol. Mass.:
233.3492
SMILES:
CCCC(O)\C=C\c1cccc(CCCN)c1
: