Target
Retinaldehyde-binding protein 1
Ligand
BDBM338972
Substrate
Meas. Tech.
Isomerase Assay
IC50
<10000±n/a nM
Citation
 Scott, ILKuksa, VAGall, AOrme, MWGage, JLittle, Jr., TLJiang, QRossiter, LMMcGee, Jr., KFKubota, R Styrenyl derivative compounds for treating ophthalmic diseases and disorders US Patent  US10201545 Publication Date 2/12/2019 
Target
Name:
Retinaldehyde-binding protein 1
Synonyms:
CRALBP RLBP1 | RLBP1_HUMAN
Type:
Enzyme Catalytic Domain
Mol. Mass.:
36462.25
Organism:
Homo sapiens (Human)
Description:
P12271
Residue:
317
  
Inhibitor
Name:
BDBM338972
Synonyms:
(E/Z)-3-(3-(2-ethynylstyryl)phenyl)propan-1-amine | US10201545, Compound 37
Type:
Small organic molecule
Emp. Form.:
C19H19N
Mol. Mass.:
261.3609
SMILES:
NCCCc1cccc(\C=C/c2ccccc2C#C)c1
: