Target
Retinaldehyde-binding protein 1
Ligand
BDBM338973
Substrate
Meas. Tech.
Isomerase Assay
IC50
<10000±n/a nM
Citation
 Scott, ILKuksa, VAGall, AOrme, MWGage, JLittle, Jr., TLJiang, QRossiter, LMMcGee, Jr., KFKubota, R Styrenyl derivative compounds for treating ophthalmic diseases and disorders US Patent  US10201545 Publication Date 2/12/2019 
Target
Name:
Retinaldehyde-binding protein 1
Synonyms:
CRALBP RLBP1 | RLBP1_HUMAN
Type:
Enzyme Catalytic Domain
Mol. Mass.:
36462.25
Organism:
Homo sapiens (Human)
Description:
P12271
Residue:
317
  
Inhibitor
Name:
BDBM338973
Synonyms:
(E/Z)-3-(3-(2-isopropylstyryl)phenyl)propan-1-amine | US10201545, Compound 39
Type:
Small organic molecule
Emp. Form.:
C20H25N
Mol. Mass.:
279.4192
SMILES:
CC(C)c1ccccc1\C=C/c1cccc(CCCN)c1
: