Target
Retinaldehyde-binding protein 1
Ligand
BDBM338974
Substrate
Meas. Tech.
Isomerase Assay
IC50
<10000±n/a nM
Citation
 Scott, ILKuksa, VAGall, AOrme, MWGage, JLittle, Jr., TLJiang, QRossiter, LMMcGee, Jr., KFKubota, R Styrenyl derivative compounds for treating ophthalmic diseases and disorders US Patent  US10201545 Publication Date 2/12/2019 
Target
Name:
Retinaldehyde-binding protein 1
Synonyms:
CRALBP RLBP1 | RLBP1_HUMAN
Type:
Enzyme Catalytic Domain
Mol. Mass.:
36462.25
Organism:
Homo sapiens (Human)
Description:
P12271
Residue:
317
  
Inhibitor
Name:
BDBM338974
Synonyms:
(E/Z)-3-(3-(2,3-dimethylstyryl)phenyl)propan-1-amine | US10201545, Compound 44
Type:
Small organic molecule
Emp. Form.:
C19H23N
Mol. Mass.:
265.3926
SMILES:
Cc1cccc(\C=C/c2cccc(CCCN)c2)c1C
: