Target
Retinaldehyde-binding protein 1
Ligand
BDBM338978
Substrate
Meas. Tech.
Isomerase Assay
IC50
<10000±n/a nM
Citation
 Scott, ILKuksa, VAGall, AOrme, MWGage, JLittle, Jr., TLJiang, QRossiter, LMMcGee, Jr., KFKubota, R Styrenyl derivative compounds for treating ophthalmic diseases and disorders US Patent  US10201545 Publication Date 2/12/2019 
Target
Name:
Retinaldehyde-binding protein 1
Synonyms:
CRALBP RLBP1 | RLBP1_HUMAN
Type:
Enzyme Catalytic Domain
Mol. Mass.:
36462.25
Organism:
Homo sapiens (Human)
Description:
P12271
Residue:
317
  
Inhibitor
Name:
BDBM338978
Synonyms:
(E/Z)-N-(3-(3-(2,6-dimethylstyryl)phenyl)prop- yl)acetamide | US10201545, Compound 51
Type:
Small organic molecule
Emp. Form.:
C21H25NO
Mol. Mass.:
307.4293
SMILES:
CC(=O)NCCCc1cccc(C=Cc2c(C)cccc2C)c1
: