Target
Tyrosine-protein phosphatase non-receptor type 1 [1-298]
Ligand
BDBM13963
Substrate
BDBM13466
Meas. Tech.
PTP1B and TCPTP Inhibition Assay
pH
7.5±n/a
Temperature
295.15±n/a K
Ki
17000±4000 nM
Kd
35000±n/a nM
Comments
Kd derived from 15N-labeled PTP1B
Citation
 Liu, GSzczepankiewicz, BGPei, ZJanowick, DAXin, ZHajduk, PJAbad-Zapatero, CLiang, HHutchins, CWFesik, SWBallaron, SJStashko, MALubben, TMika, AKZinker, BATrevillyan, JMJirousek, MR Discovery and structure-activity relationship of oxalylarylaminobenzoic acids as inhibitors of protein tyrosine phosphatase 1B. J Med Chem 46:2093-103 (2003)  
Target
Name:
Tyrosine-protein phosphatase non-receptor type 1 [1-298]
Synonyms:
PTN1_HUMAN PTP1B PTPase 1B Tyrosine-protein phosphatase, non-receptor type 1
Type:
Enzyme
Mol. Mass.:
34670.65
Organism:
Homo sapiens (Human)
Description:
The catalytic domain of PTP 1B (residues 1-298) was expressed and purified from E. coli.
Residue:
298
  
Inhibitor
Name:
BDBM13963
Synonyms:
2-{[2-(2-Hydroxyethyl)phenyl]oxalylamino}benzoic Acid Oxalylarylaminobenzoic Acid Analog 8g
Type:
Small organic molecule
Emp. Form.:
C17H15NO6
Mol. Mass.:
329.3041
SMILES:
OCCc1ccccc1N(C(=O)C(O)=O)c1ccccc1C(O)=O
:
Substrate
Name:
BDBM13466
Synonyms:
4-Nitrophenyl phosphate disodium salt hexahydrate disodium (4-nitrophenyl) phosphate | para-nitrophenyl phosphate (pNPP)
Type:
Small organic molecule
Emp. Form.:
C6H4NO6P
Mol. Mass.:
217.0739
SMILES:
[O-][N+](=O)c1ccc(O[P+]([O-])([O-])[O-])cc1
: