Target
Tyrosine-protein phosphatase non-receptor type 1 [1-298]
Ligand
BDBM13953
Substrate
BDBM13466
Meas. Tech.
PTP1B and TCPTP Inhibition Assay
Ki
1100±n/a nM
Citation
 Liu, GSzczepankiewicz, BGPei, ZJanowick, DAXin, ZHajduk, PJAbad-Zapatero, CLiang, HHutchins, CWFesik, SWBallaron, SJStashko, MALubben, TMika, AKZinker, BATrevillyan, JMJirousek, MR Discovery and structure-activity relationship of oxalylarylaminobenzoic acids as inhibitors of protein tyrosine phosphatase 1B. J Med Chem 46:2093-103 (2003)  
Target
Name:
Tyrosine-protein phosphatase non-receptor type 1 [1-298]
Synonyms:
PTN1_HUMAN PTP1B PTPase 1B Tyrosine-protein phosphatase, non-receptor type 1
Type:
Enzyme
Mol. Mass.:
34670.65
Organism:
Homo sapiens (Human)
Description:
The catalytic domain of PTP 1B (residues 1-298) was expressed and purified from E. coli.
Residue:
298
  
Inhibitor
Name:
BDBM13953
Synonyms:
1:1 racemic mixture 2-{[4-(2-Acetylamino-2-pentylcarbamoylethyl)naphthalen-1-yl]oxalylamino}benzoic Acid N-Acetyl-4-[(carboxycarbonyl)(2-carboxyphenyl)amino]-N-pentyl-1-naphthylalaninamide linked-fragment derived compound 12
Type:
Small organic molecule
Emp. Form.:
C29H31N3O7
Mol. Mass.:
533.5723
SMILES:
CCCCCNC(=O)C(Cc1ccc(N(C(=O)C(O)=O)c2ccccc2C(O)=O)c2ccccc12)NC(C)=O
:
Substrate
Name:
BDBM13466
Synonyms:
4-Nitrophenyl phosphate disodium salt hexahydrate disodium (4-nitrophenyl) phosphate | para-nitrophenyl phosphate (pNPP)
Type:
Small organic molecule
Emp. Form.:
C6H4NO6P
Mol. Mass.:
217.0739
SMILES:
[O-][N+](=O)c1ccc(O[P+]([O-])([O-])[O-])cc1
: