Target
Tyrosine-protein phosphatase non-receptor type 1 [1-298]
Ligand
BDBM13996
Substrate
BDBM13466
Meas. Tech.
PTP1B and TCPTP Inhibition Assay
pH
7.5±n/a
Temperature
295.15±n/a K
Ki
2100±n/a nM
Citation
 Zhao, HLiu, GXin, ZSerby, MDPei, ZSzczepankiewicz, BGHajduk, PJAbad-Zapatero, CHutchins, CWLubben, THBallaron, SJHaasch, DLKaszubska, WRondinone, CMTrevillyan, JMJirousek, MR Isoxazole carboxylic acids as protein tyrosine phosphatase 1B (PTP1B) inhibitors. Bioorg Med Chem Lett 14:5543-6 (2004)  
Target
Name:
Tyrosine-protein phosphatase non-receptor type 1 [1-298]
Synonyms:
PTN1_HUMAN PTP1B PTPase 1B Tyrosine-protein phosphatase, non-receptor type 1
Type:
Enzyme
Mol. Mass.:
34670.65
Organism:
Homo sapiens (Human)
Description:
The catalytic domain of PTP 1B (residues 1-298) was expressed and purified from E. coli.
Residue:
298
  
Inhibitor
Name:
BDBM13996
Synonyms:
4-amino-5-{3-[(1E)-3-[3-hydroxy-2-(methoxycarbonyl)phenoxy]prop-1-en-1-yl]phenyl}-1,2-oxazole-3-carboxylic acid | Isoxazole carboxylic acid analog 7
Type:
Small organic molecule
Emp. Form.:
C21H18N2O7
Mol. Mass.:
410.3768
SMILES:
COC(=O)c1c(O)cccc1OC\C=C\c1cccc(c1)-c1onc(C(O)=O)c1N
:
Substrate
Name:
BDBM13466
Synonyms:
4-Nitrophenyl phosphate disodium salt hexahydrate disodium (4-nitrophenyl) phosphate | para-nitrophenyl phosphate (pNPP)
Type:
Small organic molecule
Emp. Form.:
C6H4NO6P
Mol. Mass.:
217.0739
SMILES:
[O-][N+](=O)c1ccc(O[P+]([O-])([O-])[O-])cc1
: