Target
Tyrosine-protein kinase Lck
Ligand
BDBM340173
Substrate
Meas. Tech.
Lck Enzyme Activity
EC50
>1000±n/a nM
Citation
 Barf, TAJans, CGde Man, APOubrie, AARaaijmakers, HCRewinkel, JBSterrenburg, JGWijkmans, JC 4-imidazopyridazin-1-yl-benzamides as Btk inhibitors US Patent  US9758524 Publication Date 9/12/2017 
Target
Name:
Tyrosine-protein kinase Lck
Synonyms:
2.7.10.2 LCK_HUMAN Leukocyte C-terminal Src kinase Lymphocyte-specific protein tyrosine kinase Protein YT16 Proto-oncogene tyrosine-protein kinase LCK T cell-specific protein-tyrosine kinase
Type:
Mol. Mass.:
57987.83
Organism:
Homo sapiens (Human)
Description:
P06239
Residue:
509
  
Inhibitor
Name:
BDBM340173
Synonyms:
(S)-4-(8-amino-3-(1-but-2- ynoylpyrrolidin-2-yl)imidazo[1,5- a]pyrazin-1-yl)-N-(4- isopropylpyridin-2-yl)benzamide US10934296, Example 102 | US9758524, Example 102
Type:
Small organic molecule
Emp. Form.:
C29H29N7O2
Mol. Mass.:
507.5863
SMILES:
CC#CC(=O)N1CCC[C@H]1c1nc(-c2ccc(cc2)C(=O)Nc2cc(ccn2)C(C)C)c2c(N)nccn12
: