Target
Tyrosine-protein kinase Lck
Ligand
BDBM340117
Substrate
Meas. Tech.
Lck Enzyme Activity
EC50
>1000±n/a nM
Citation
 Barf, TAJans, CGde Man, APOubrie, AARaaijmakers, HCRewinkel, JBSterrenburg, JGWijkmans, JC 4-imidazopyridazin-1-yl-benzamides as Btk inhibitors US Patent  US9758524 Publication Date 9/12/2017 
Target
Name:
Tyrosine-protein kinase Lck
Synonyms:
2.7.10.2 LCK_HUMAN Leukocyte C-terminal Src kinase Lymphocyte-specific protein tyrosine kinase Protein YT16 Proto-oncogene tyrosine-protein kinase LCK T cell-specific protein-tyrosine kinase
Type:
Mol. Mass.:
57987.83
Organism:
Homo sapiens (Human)
Description:
P06239
Residue:
509
  
Inhibitor
Name:
BDBM340117
Synonyms:
(S)-4-(8-amino-3-(1-(2- chloropyrimidine-4- carbonyl)pyrrolidin-2- yl)imidazo[1,5-a]pyrazin-1-yl)-N-(4- (trifluoromethyl)pyridin-2- yl)benzamide US10934296, Example 119 | US9758524, Example 119
Type:
Small organic molecule
Emp. Form.:
C28H21ClF3N9O2
Mol. Mass.:
607.974
SMILES:
Nc1nccn2c(nc(-c3ccc(cc3)C(=O)Nc3cc(ccn3)C(F)(F)F)c12)[C@@H]1CCCN1C(=O)c1ccnc(Cl)n1
: