Target
Tyrosine-protein kinase Lck
Ligand
BDBM340192
Substrate
Meas. Tech.
Lck Enzyme Activity
EC50
>1000±n/a nM
Citation
 Barf, TAJans, CGde Man, APOubrie, AARaaijmakers, HCRewinkel, JBSterrenburg, JGWijkmans, JC 4-imidazopyridazin-1-yl-benzamides as Btk inhibitors US Patent  US9758524 Publication Date 9/12/2017 
Target
Name:
Tyrosine-protein kinase Lck
Synonyms:
2.7.10.2 LCK_HUMAN Leukocyte C-terminal Src kinase Lymphocyte-specific protein tyrosine kinase Protein YT16 Proto-oncogene tyrosine-protein kinase LCK T cell-specific protein-tyrosine kinase
Type:
Mol. Mass.:
57987.83
Organism:
Homo sapiens (Human)
Description:
P06239
Residue:
509
  
Inhibitor
Name:
BDBM340192
Synonyms:
(S)-4-(8-amino-3-(1-(2- chloropyrimidine-4- carbonyl)pyrrolidin-2- yl)imidazo[1,5-a]pyrazin-1-yl)-N-(4- methylpyridin-2-yl)benzamide US10934296, Example 129 | US9758524, Example 129
Type:
Small organic molecule
Emp. Form.:
C28H24ClN9O2
Mol. Mass.:
554.002
SMILES:
Cc1ccnc(NC(=O)c2ccc(cc2)-c2nc([C@@H]3CCCN3C(=O)c3ccnc(Cl)n3)n3ccnc(N)c23)c1
: