Target
Ataxin-1
Ligand
BDBM321944
Substrate
Meas. Tech.
Biological Assay
IC50
2.00±n/a nM
Citation
 Beattie, DBaettig, ULegrand, DMLister, ASMcKenna, JPearce, DWSandham, DASteward, ORThomson, C Autotaxin inhibitors US Patent  US9763957 Publication Date 9/19/2017 
Target
Name:
Ataxin-1
Synonyms:
ATX1 ATXN1 | SCA1
Type:
Protein
Mol. Mass.:
86941.25
Organism:
Homo sapiens (Human)
Description:
P54253
Residue:
815
  
Inhibitor
Name:
BDBM321944
Synonyms:
(E)-1-(4-((1-Methyl-1H-pyrazol-4-yl)methyl)piperazin-1-yl)-3-(2-((5-methyl-2H-tetrazol-2-yl)methyl)-4-(trifluoromethyl)phenyl)prop-2-en-1-one US9763957, Example 53
Type:
Small organic molecule
Emp. Form.:
C22H25F3N8O
Mol. Mass.:
474.4821
SMILES:
Cc1nnn(Cc2cc(ccc2\C=C\C(=O)N2CCN(Cc3cnn(C)c3)CC2)C(F)(F)F)n1
: