Target
Tyrosine-protein phosphatase non-receptor type 1 [1-298]
Ligand
BDBM14282
Substrate
BDBM13466
Meas. Tech.
Phosphatase Inhibition Assay
IC50
350±n/a nM
Citation
 Sparks, RBPolam, PZhu, WCrawley, MLTakvorian, AMcLaughlin, EWei, MAla, PJGonneville, LTaylor, NLi, YWynn, RBurn, TCLiu, PCCombs, AP Benzothiazole benzimidazole (S)-isothiazolidinone derivatives as protein tyrosine phosphatase-1B inhibitors. Bioorg Med Chem Lett 17:736-40 (2007)  
Target
Name:
Tyrosine-protein phosphatase non-receptor type 1 [1-298]
Synonyms:
PTN1_HUMAN PTP1B PTPase 1B Tyrosine-protein phosphatase, non-receptor type 1
Type:
Enzyme
Mol. Mass.:
34670.65
Organism:
Homo sapiens (Human)
Description:
The catalytic domain of PTP 1B (residues 1-298) was expressed and purified from E. coli.
Residue:
298
  
Inhibitor
Name:
BDBM14282
Synonyms:
5-{4-[(2S)-2-(1H-1,3-benzodiazol-2-yl)-2-[(6-methoxy-1,3-benzothiazol-2-yl)amino]ethyl]phenyl}-1,2-thiazolidine-1,1,3-trione | IZD deriv. 18
Type:
Small organic molecule
Emp. Form.:
C26H23N5O4S2
Mol. Mass.:
533.622
SMILES:
COc1ccc2nc(N[C@@H](Cc3ccc(cc3)C3CC(=O)NS3(=O)=O)c3nc4ccccc4[nH]3)sc2c1
:
Substrate
Name:
BDBM13466
Synonyms:
4-Nitrophenyl phosphate disodium salt hexahydrate disodium (4-nitrophenyl) phosphate | para-nitrophenyl phosphate (pNPP)
Type:
Small organic molecule
Emp. Form.:
C6H4NO6P
Mol. Mass.:
217.0739
SMILES:
[O-][N+](=O)c1ccc(O[P+]([O-])([O-])[O-])cc1
: