Target
High affinity cAMP-specific and IBMX-insensitive 3',5'-cyclic phosphodiesterase 8A
Ligand
BDBM14772
Substrate
BDBM10851
Meas. Tech.
Phosphodiesterase (PDE) Inhibition Assay
IC50
>200000±n/a nM
Citation
 Card, GLEngland, BPSuzuki, YFong, DPowell, BLee, BLuu, CTabrizizad, MGillette, SIbrahim, PNArtis, DRBollag, GMilburn, MVKim, SHSchlessinger, JZhang, KY Structural basis for the activity of drugs that inhibit phosphodiesterases. Structure 12:2233-47 (2004)  
Target
Name:
High affinity cAMP-specific and IBMX-insensitive 3',5'-cyclic phosphodiesterase 8A
Synonyms:
High-affinity cAMP-specific and IBMX-insensitive 3 ,5 -cyclic phosphodiesterase 8A PDE8A_HUMAN Phosphodiesterase 8 (PDE8) Phosphodiesterase 8A (PDE8A1) Phosphodiesterase Type 8 (PDE8A)
Type:
Enzyme Catalytic Domain
Mol. Mass.:
93295.89
Organism:
Homo sapiens (Human)
Description:
Recombinant catalytic domain (M1-E829) of human PDE8A.
Residue:
829
  
Inhibitor
Name:
BDBM14772
Synonyms:
(R,S)-Mesopram 5-(4-methoxy-3-propoxyphenyl)-5-methyl-1,3-oxazolidin-2-one | Daxalipram
Type:
Small organic molecule
Emp. Form.:
C14H19NO4
Mol. Mass.:
265.305
SMILES:
CCCOc1cc(ccc1OC)C1(C)CNC(=O)O1
:
Substrate
Name:
BDBM10851
Synonyms:
(4aR,6R,7R,7aS)-6-(6-amino-9H-purin-9-yl)-2,7-dihydroxy-hexahydro-1,3,5,2-furo[3,2-d][1,3,2]dioxaphosphinin-2-one ADENOSINE-3 ,5 -CYCLIC-MONOPHOSPHATE cAMP | cid_23902375
Type:
Small organic molecule
Emp. Form.:
C10H12N5O6P
Mol. Mass.:
329.2059
SMILES:
Nc1ncnc2n(cnc12)[C@@H]1O[C@@H]2COP(O)(=O)O[C@H]2[C@H]1O
: