Target
cAMP-specific 3',5'-cyclic phosphodiesterase 4B [316-320,321-700,S319G,N320S,N321H,T322M]
Ligand
BDBM14786
Substrate
BDBM10851
Meas. Tech.
Phosphodiesterase (PDE) Inhibition Assay
pH
7.5±n/a
Temperature
303.15±n/a K
IC50
1500±n/a nM
Citation
 Card, GLBlasdel, LEngland, BPZhang, CSuzuki, YGillette, SFong, DIbrahim, PNArtis, DRBollag, GMilburn, MVKim, SHSchlessinger, JZhang, KY A family of phosphodiesterase inhibitors discovered by cocrystallography and scaffold-based drug design. Nat Biotechnol 23:201-7 (2005)  
Target
Name:
cAMP-specific 3',5'-cyclic phosphodiesterase 4B [316-320,321-700,S319G,N320S,N321H,T322M]
Synonyms:
DPDE4 PDE4B Phosphodiesterase Type 4 (PDE4B) | cAMP-specific 3,5-cyclic phosphodiesterase 4B
Type:
Enzyme Catalytic Domain
Mol. Mass.:
45579.64
Organism:
Homo sapiens (Human)
Description:
RECOMBINANT CATALYTIC DOMAIN OF HUMAN PHOSPHODIESTERASE 4B.
Residue:
398
  
Inhibitor
Name:
BDBM14786
Synonyms:
Pyrazole carboxylic ester 9 | ethyl 3-(4-chlorophenyl)-1-phenyl-1H-pyrazole-4-carboxylate
Type:
Small organic molecule
Emp. Form.:
C18H15ClN2O2
Mol. Mass.:
326.777
SMILES:
CCOC(=O)c1cn(nc1-c1ccc(Cl)cc1)-c1ccccc1
:
Substrate
Name:
BDBM10851
Synonyms:
(4aR,6R,7R,7aS)-6-(6-amino-9H-purin-9-yl)-2,7-dihydroxy-hexahydro-1,3,5,2-furo[3,2-d][1,3,2]dioxaphosphinin-2-one ADENOSINE-3 ,5 -CYCLIC-MONOPHOSPHATE cAMP | cid_23902375
Type:
Small organic molecule
Emp. Form.:
C10H12N5O6P
Mol. Mass.:
329.2059
SMILES:
Nc1ncnc2n(cnc12)[C@@H]1O[C@@H]2COP(O)(=O)O[C@H]2[C@H]1O
: