Target
Ubiquitin carboxyl-terminal hydrolase 15
Ligand
BDBM65524
Substrate
Meas. Tech.
Fluorometric Ub-AMC Hydrolysis Assay
pH
7.5±n/a
Temperature
298.15±n/a K
IC50
>114000±n/a nM
Comments
extracted
Citation
 Ott, CABaljinnyam, BZakharov, AVJadhav, ASimeonov, AZhuang, Z Cell Lysate-Based AlphaLISA Deubiquitinase Assay Platform for Identification of Small Molecule Inhibitors. ACS Chem Biol 12:2399-2407 (2017)  
Target
Name:
Ubiquitin carboxyl-terminal hydrolase 15
Synonyms:
Deubiquitinating enzyme 15 UBP15_HUMAN Ubiquitin thioesterase 15 Unph-2 | Unph4
Type:
Protein
Mol. Mass.:
112388.07
Organism:
Homo sapiens (Human)
Description:
Q9Y4E8
Residue:
981
  
Inhibitor
Name:
BDBM65524
Synonyms:
(-)-Aricine Quinovatine
Type:
Small organic molecule
Emp. Form.:
C22H26N2O4
Mol. Mass.:
382.4528
SMILES:
COC(=O)C1=CO[C@@H](C)[C@@H]2CN3CCc4c([nH]c5cc(OC)ccc45)[C@@H]3C[C@H]12
: