Target
Lysine-specific demethylase 4C
Ligand
BDBM296122
Substrate
Meas. Tech.
JMJD2C Assay
IC50
550±n/a nM
Citation
 Boloor, AKanouni, TStafford, JAVeal, JMWallace, MB Histone demethylase inhibitors US Patent  US10202381 Publication Date 2/12/2019 
Target
Name:
Lysine-specific demethylase 4C
Synonyms:
GASC-1 protein Gene amplified in squamous cell carcinoma 1 protein JMJD2C Jumonji domain-containing protein 2C KDM4C_HUMAN | KIAA0780
Type:
Protein
Mol. Mass.:
119979.01
Organism:
Homo sapiens (Human)
Description:
Q9H3R0
Residue:
1056
  
Inhibitor
Name:
BDBM296122
Synonyms:
2-[4-[3-(dimethylamino)-N- methylanilino]phenoxy]pyrido[3,4- d]pyrimidin-4-ol US10202381, Example 47 US10611763, Example 47 US11535616, Example 47
Type:
Small organic molecule
Emp. Form.:
C22H21N5O2
Mol. Mass.:
387.4344
SMILES:
CN(C)c1cccc(c1)N(C)c1ccc(Oc2nc(O)c3ccncc3n2)cc1
: