Target
D-amino-acid oxidase
Ligand
BDBM50431066
Substrate
Meas. Tech.
DAAO Inhibitory Activity Assay
IC50
2.40±n/a nM
Citation
 Hondo, TNakanishi, KNiimi, TWarizaya, MNamatame, IHarada, K Dihydroxy aromatic heterocyclic compound US Patent  US10202399 Publication Date 2/12/2019 
Target
Name:
D-amino-acid oxidase
Synonyms:
D-amino-acid oxidase (DAAO) DAMOX OXDA_HUMAN
Type:
Homodimer
Mol. Mass.:
39476.06
Organism:
Homo sapiens (Human)
Description:
P14920
Residue:
347
  
Inhibitor
Name:
BDBM50431066
Synonyms:
CHEMBL2338798 US10463663, Example 11 US9212147, 17 US9931340, Example 11
Type:
Small organic molecule
Emp. Form.:
C13H11F3N2O2
Mol. Mass.:
284.2338
SMILES:
Oc1cc(CCc2cccc(c2)C(F)(F)F)n[nH]c1=O
: