Target
Lysine-specific histone demethylase 1A
Ligand
BDBM283255
Substrate
Meas. Tech.
In Vitro Enzyme Inhibition Assay LSD-1
IC50
<100±n/a nM
Citation
 Chen, YKKanouni, TKaldor, SWStafford, JAVeal, JM Inhibitors of lysine specific demethylase-1 US Patent  US10207999 Publication Date 2/19/2019 
Target
Name:
Lysine-specific histone demethylase 1A
Synonyms:
AOF2 Flavin-containing amine oxidase domain-containing protein 2 KDM1A KIAA0601 Lysine-specific demethylase 1 (LSD1) Lysine-specific histone demethylase 1 (LSD1)
Type:
Enzyme
Mol. Mass.:
92901.01
Organism:
Homo sapiens (Human)
Description:
O60341
Residue:
852
  
Inhibitor
Name:
BDBM283255
Synonyms:
US10023543, Example 40 US10328077, Example 40 US10849898, Example 40 US11084793, Example 40 US9771329, Example 40 {4-[2-(4-aminopiperidyl)-6- (4-cyanophenyl)-3-methyl-4-oxo (3-hydro pyrimidin-5-yl)]-2- fluorophenyl}-N- methylcarboxamide
Type:
Small organic molecule
Emp. Form.:
C25H25FN6O2
Mol. Mass.:
460.5034
SMILES:
CNC(=O)c1ccc(cc1F)-c1c(nc(N2CCC(N)CC2)n(C)c1=O)-c1ccc(cc1)C#N
: