Target
Lysine-specific histone demethylase 1A
Ligand
BDBM283258
Substrate
Meas. Tech.
In Vitro Enzyme Inhibition Assay LSD-1
IC50
<100±n/a nM
Citation
 Chen, YKKanouni, TKaldor, SWStafford, JAVeal, JM Inhibitors of lysine specific demethylase-1 US Patent  US10207999 Publication Date 2/19/2019 
Target
Name:
Lysine-specific histone demethylase 1A
Synonyms:
AOF2 Flavin-containing amine oxidase domain-containing protein 2 KDM1A KIAA0601 Lysine-specific demethylase 1 (LSD1) Lysine-specific histone demethylase 1 (LSD1)
Type:
Enzyme
Mol. Mass.:
92901.01
Organism:
Homo sapiens (Human)
Description:
O60341
Residue:
852
  
Inhibitor
Name:
BDBM283258
Synonyms:
4-[2-(4-amino-piperidin-1-yl)-1- methyl-6-oxo-5-(1-oxo-2,3- dihydro-1H-isoindol-5-yl)-1,6- dihydro-pyrimidin-4-yl]-2-fluoro- benzonitrile US10023543, Example 42 US10328077, Example 42 US10849898, Example 42 US11084793, Example 42 US9771329, Example 42 | US9776974, Example 42
Type:
Small organic molecule
Emp. Form.:
C25H23FN6O2
Mol. Mass.:
458.4875
SMILES:
Cn1c(nc(-c2ccc(C#N)c(F)c2)c(-c2ccc3C(=O)NCc3c2)c1=O)N1CCC(N)CC1
: