Target
P2X purinoceptor 7
Ligand
BDBM160080
Substrate
Meas. Tech.
Radioligand binding assay
Ki
1.40±n/a nM
Citation
 Ameriks, MKRech, JCSavall, BM Substituted [1,2,4]triazolo[4,3-a]pyrazines as P2X7 modulators US Patent  US10047092 Publication Date 8/14/2018 
Target
Name:
P2X purinoceptor 7
Synonyms:
ATP receptor P2RX7_HUMAN P2X purinoceptor 7 (P2X7) P2Z receptor | Purinergic receptor
Type:
Protein
Mol. Mass.:
68602.85
Organism:
Homo sapiens (Human)
Description:
Q99572
Residue:
595
  
Inhibitor
Name:
BDBM160080
Synonyms:
US10047092, 21 US9040534, 21
Type:
Small organic molecule
Emp. Form.:
C17H13ClF3N5O2
Mol. Mass.:
411.766
SMILES:
C[C@H]1Cn2c(nnc2C(=O)N1Cc1cccc(c1Cl)C(F)(F)F)-c1cocn1
: