Target
Coagulation factor X
Ligand
BDBM16127
Substrate
BDBM13789
Meas. Tech.
Enzyme Inhibition Assay
Ki
10000±n/a nM
Citation
 Katz, BAClark, JMFiner-Moore, JSJenkins, TEJohnson, CRRoss, MJLuong, CMoore, WRStroud, RM Design of potent selective zinc-mediated serine protease inhibitors. Nature 391:608-12 (1998)  
Target
Name:
Coagulation factor X
Synonyms:
Activated coagulation factor X (FXa) Coagulation factor X precursor F10 Factor X heavy chain Factor Xa Stuart-Prower factor
Type:
Enzyme
Mol. Mass.:
54726.60
Organism:
Homo sapiens (Human)
Description:
Residue:
488
  
Inhibitor
Name:
BDBM16127
Synonyms:
2,2 -methanediylbis(1H-benzimidazole-6-carboximidamide) AIDS007118 CHEMBL542712 | CHEMBL99951
Type:
Small organic molecule
Emp. Form.:
C17H16N8
Mol. Mass.:
332.3625
SMILES:
NC(=N)c1ccc2nc(Cc3nc4ccc(cc4[nH]3)C(N)=N)[nH]c2c1
:
Substrate
Name:
BDBM13789
Synonyms:
Factor Xa Chromogenic Substrate methyl N-[(1S)-1-[({[(1S)-4-carbamimidamido-1-[(4-nitrophenyl)carbamoyl]butyl]carbamoyl}methyl)carbamoyl]pentyl]carbamate
Type:
Small organic molecule
Emp. Form.:
C22H34N8O7
Mol. Mass.:
522.5548
SMILES:
CCCC[C@H](NC(=O)OC)C(=O)NCC(=O)N[C@@H](CCCNC(N)=N)C(=O)Nc1ccc(cc1)[N+]([O-])=O
: