Target
Glycogen synthase kinase-3 beta
Ligand
BDBM16591
Substrate
Phosphor-Glycogen Synthase Peptide-2
Meas. Tech.
Kinase assays for IC50 determinations
pH
7.5±n/a
Temperature
295.15±n/a K
IC50
168±13 nM
Citation
 Foloppe, NFisher, LMFrancis, GHowes, RKierstan, PPotter, A Identification of a buried pocket for potent and selective inhibition of Chk1: prediction and verification. Bioorg Med Chem 14:1792-804 (2006)  
Target
Name:
Glycogen synthase kinase-3 beta
Synonyms:
GSK-3 beta GSK3B Glycogen synthase kinase 3 beta (GSK3B) Glycogen synthase kinase-3 beta (GSK-3B) Glycogen synthase kinase-3 beta (GSK3B) Glycogen synthase kinase-3beta (GSK3B) | Serine/threonine-protein kinase GSK3B
Type:
Enzyme
Mol. Mass.:
46756.38
Organism:
Homo sapiens (Human)
Description:
P49841
Residue:
420
  
Inhibitor
Name:
BDBM16591
Synonyms:
(4Z)-4-(2-amino-5-oxo-3,5-dihydro-4H-imidazol-4-ylidene)-4,5,6,7-tetrahydropyrrolo[2,3-c]azepin-8(1H)-one B722657K110 Debromohymenialdisine (DBH) NSC607174
Type:
Small organic molecule
Emp. Form.:
C11H11N5O2
Mol. Mass.:
245.2373
SMILES:
NC1=NC(=O)C(N1)=C1CCNC(=O)c2[nH]ccc12
:
Substrate
Name:
Phosphor-Glycogen Synthase Peptide-2
Synonyms:
Synthetic GSK3 substrate peptide
Type:
Peptide
Mol. Mass.:
3045.17
Organism:
Description:
Residue:
27