Target
RAC-alpha serine/threonine-protein kinase
Ligand
BDBM16591
Substrate
Histone H1
Meas. Tech.
Kinase assays for IC50 determinations
pH
7.5±n/a
Temperature
303.15±n/a K
IC50
>50000±n/a nM
Citation
 Foloppe, NFisher, LMFrancis, GHowes, RKierstan, PPotter, A Identification of a buried pocket for potent and selective inhibition of Chk1: prediction and verification. Bioorg Med Chem 14:1792-804 (2006)  
Target
Name:
RAC-alpha serine/threonine-protein kinase
Synonyms:
AKT phosphorylation (p-AKT) AKT1/PPP1CA C-AKT PKB alpha Protein kinase B Protein kinase B (Akt 1) Protein kinase B alpha Proto-oncogene Akt (Akt1) Proto-oncogene c-Akt (AKT1) RAC-PK-alpha RAC-alpha serine/threonine-protein kinase (AKT1) | RAC-alpha serine/threonine-protein kinase (pAKT)
Type:
Enzyme
Mol. Mass.:
55681.25
Organism:
Homo sapiens (Human)
Description:
P31749
Residue:
480
  
Inhibitor
Name:
BDBM16591
Synonyms:
(4Z)-4-(2-amino-5-oxo-3,5-dihydro-4H-imidazol-4-ylidene)-4,5,6,7-tetrahydropyrrolo[2,3-c]azepin-8(1H)-one B722657K110 Debromohymenialdisine (DBH) NSC607174
Type:
Small organic molecule
Emp. Form.:
C11H11N5O2
Mol. Mass.:
245.2373
SMILES:
NC1=NC(=O)C(N1)=C1CCNC(=O)c2[nH]ccc12
:
Substrate
Name:
Histone H1
Synonyms:
Type:
Other Protein Type
Mol. Mass.:
358.43
Organism:
Bos taurus (bovine)
Description:
Residue:
3
NA